{"text_format":"1","workbook":"xlsx","n_sheets":10,"sheets":["Enhance logic (Do not use)","Introduction & Help","Tender Finder","Competition Data","Hidden Tabs >>","Manual Entry ","Data","Lists & wording","result period from comp name","result type from comp name"],"not_rendered":{"charts":0,"images":3,"macros":1,"external_links":0,"defined_names":10,"comments":0,"pivot_tables":0},"unopened":[],"bounds":{"document_bytes":16777216,"sheet_cells":100000,"rows_first":2000,"rows_last":500,"rows_between":2000,"halvings":0,"cell_chars":16384,"cell_head_chars":4096},"cells_cut":0,"cells_raw":0,"read":"whole","date_system":"1900"}

{"sheet":"Enhance logic (Do not use)","index":0,"n_rows":17,"n_cols":10,"rows_kept":17,"cut":false,"hidden":true,"merged":[[7,7,7,8],[8,7,8,8],[9,3,9,4],[14,0,14,2],[14,3,15,3],[14,4,14,7],[14,8,15,8],[3,6,3,7],[4,0,6,0],[4,3,4,4],[4,7,4,8],[5,3,5,4],[5,7,5,8],[6,3,6,4],[6,7,6,8]]}
[]
[null,"Tender Finder","Yes"]
[]
[null,"Insert Bid Details Here",null,null,null,null,"Competition details (auto-populated)"]
["Competion details","Competition Name",null,{"$f":"IF(ISBLANK(C5),\"Enter data\",\"\")","v":"Enter data"},null,null,"Competition ID",{"$f":"IF(C2=\"No\",\"N/A\",IFERROR(VLOOKUP(J5,Data!$A:$I,3,FALSE),\"No tender matching these perameters\"))","v":""},null,{"$f":"CONCATENATE(C5,C6,C7)","v":""}]
[null,"Period",null,{"$f":"IF(OR(ISBLANK(C5),ISBLANK(C6),ISBLANK(C7)),\"Enter data\",IF(H5=\"No Tender matching these perameters\",\"No tender matching these perameters\",\"\"))","v":"Enter data"},null,null,"Celling Price per annum",{"$f":"IFERROR(VLOOKUP(J5,Data!$A:$I,6,FALSE),\"No tender matching these perameters\")","v":""}]
[null,"Service Type",null,{"$f":"IF(ISBLANK(C7),\"Enter data\",\"\")","v":"Enter data"},null,null,"Availability Hours",{"$f":"IFERROR(VLOOKUP(J5,Data!$A:$I,8,FALSE),\"No tender matching these perameters\")","v":""}]
[null,{"$f":"IF(C2=\"No\",\"Insert Bid Details Here\",\"\")","v":""},null,{"$f":"IF(AND(C7=\"restore\",C9>0,C9),\"No availability payments for Restore contracts\",\"\")","v":""},null,null,"Utilisation Hours",{"$f":"IFERROR(VLOOKUP(J5,Data!$A:$I,7,FALSE),\"No tender matching these perameters\")","v":""}]
["Bid Details","Availability £/MWh",2,null,null,null,"Capacity Required MW",{"$f":"IFERROR(VLOOKUP(J5,Data!$A:$I,9,FALSE),\"No tender matching these perameters\")","v":""}]
[null,"Utilisation £/MWh",6,{"$f":"IF(C11>H9,\"Capacity exceeds network requirements\",\"\")","v":""}]
{"$rows_left_out":8}
{"sheet":"Introduction & Help","index":1,"n_rows":22,"n_cols":12,"rows_kept":22,"cut":false,"hidden":false,"merged":[[1,4,3,8],[9,1,16,9],[2,11,3,12],[8,11,14,12],[20,1,20,9],[21,1,21,9],[18,11,18,12],[18,1,19,9]]}
[]
[null,null,null,null,"Flexible Services \ncost checker"]
[null,null,null,null,null,null,null,null,null,null,null,"Click here to visit ElectronConnect"]
[]
[]
[]
[]
[]
[null,"Description:",null,null,null,null,null,null,null,null,null,"Click here to visit our website"]
[null,"The aim of this tool is to allow potential participants of ENWL's flexible services contracts to be able to check the prices they are offering for providing availability and utilisation services prior to submitting a bid. This will allow users to identify if their bid exceeds the ceiling (maximum) price which ENWL are offering as part of this tender. It should be noted that a positive or negative result from this tool does not guarantee that a bid will or will not be accepted, other factors will also be considered within the awarding of contracts post tender completion."]
{"$rows_left_out":13}
{"sheet":"Tender Finder","index":2,"n_rows":31,"n_cols":14,"rows_kept":31,"cut":false,"hidden":false,"merged":[[30,2,31,2],[30,3,31,3],[30,4,31,6],[30,8,31,9],[26,3,27,9],[26,2,27,2],[16,9,16,10],[12,4,12,6],[14,4,14,6],[16,4,16,6],[22,10,23,10],[22,6,22,9],[22,1,22,3],[22,4,23,4],[1,3,3,8],[17,4,17,6],[18,4,18,6],[13,4,13,6],[12,1,14,1],[1,13,1,14],[10,13,11,14],[15,13,15,14],[12,9,12,10],[13,9,13,10],[14,9,14,10],[15,9,15,10],[2,13,3,14]]}
[]
[null,null,null,"Flexible Services \ncost checker"]
[null,null,null,null,null,null,null,null,null,null,null,null,null,"Click here to visit ElectronConnect"]
[]
[]
[]
[]
[]
[]
[]
{"$rows_left_out":22}
{"sheet":"Competition Data","index":3,"n_rows":244,"n_cols":9,"rows_kept":244,"cut":false,"hidden":false,"merged":[]}
["Competition Name","Period","Competition type","Utilisation (hrs)","Availability (hrs)","Capacity Required (MW)","Ceiling Price for Period (£)","Competition Ref","Ceiling Price for OU/ SU/ PR\n(£/MWh)"]
["Alston","S25","Operational Utilisation Variable Availability",100,1330,0.93,97844,"ENWL-2",{"$f":"IF(OR(C2 = \"Operational Utilisation\", C2 = \"Scheduled Utilisation\", C2= \"Peak Reduction\"),G2/D2/(F2), \"N/A\")","v":"N/A"}]
["Alston","W25/26","Operational Utilisation Variable Availability",48,688,0.99,104156,"ENWL-2",{"$f":"IF(OR(C3 = \"Operational Utilisation\", C3 = \"Scheduled Utilisation\", C3= \"Peak Reduction\"),G3/D3/(F3), \"N/A\")","v":"N/A"}]
["Alston","S26","Operational Utilisation Variable Availability",100,1621,0.98,98000,"ENWL-2","N/A"]
["Alston","W26/27","Operational Utilisation Variable Availability",100,744,1.04,104000,"ENWL-2","N/A"]
["Alston","S27","Operational Utilisation Variable Availability",100,1670,1.02,97649,"ENWL-2","N/A"]
["Alston","W27/28","Operational Utilisation Variable Availability",100,813,1.0900000000000001,104351,"ENWL-2","N/A"]
["Alston","FY26","Operational Utilisation",100,0,1.4,24310,"ENWL-3",173.64285714285714]
["Alston","FY27","Operational Utilisation",100,0,1.4,24310,"ENWL-3",173.64285714285714]
["Alston","FY28","Operational Utilisation",100,0,1.4,24310,"ENWL-3",173.64285714285714]
{"$rows_left_out":235}
{"sheet":"Hidden Tabs >>","index":4,"n_rows":0,"n_cols":0,"rows_kept":0,"cut":false,"hidden":true,"merged":[]}

{"sheet":"Manual Entry ","index":5,"n_rows":22,"n_cols":12,"rows_kept":22,"cut":false,"hidden":true,"merged":[[16,9,17,9],[16,1,16,3],[16,4,17,4],[11,4,11,6],[10,4,10,6],[8,11,9,12],[1,3,3,7],[1,11,1,12],[2,11,2,12],[13,11,13,12],[21,2,22,2],[21,3,22,8],[8,7,9,8],[12,4,12,6],[8,1,9,3],[16,6,16,8]]}
[]
[null,null,null,"Flexible Services \ncost checker"]
[null,null,null,null,null,null,null,null,null,null,null,"Click here to visit Piclo"]
[]
[]
[]
[]
[]
[null,"Insert Bid Details Here",null,null,null,null,null,"Competition details (Manually-populated)",null,null,null,"Click here to visit our website"]
[]
{"$rows_left_out":13}
{"sheet":"Data","index":6,"n_rows":348,"n_cols":11,"rows_kept":348,"cut":false,"hidden":true,"merged":[]}
["Concatenate","Competition Name","Competition Ref","Period","Competition type","Celing Price per annum","Utilisation","Availability","Capacity Required",null,"Ceiling Price for OU/ SU/ PR\n(£/MWh)"]
[{"$f":"CONCATENATE(B2,D2,E2)","v":"AlstonS25Operational Utilisation Variable Availability"},{"$f":"IF(ISBLANK('Competition Data'!A2),\"\",'Competition Data'!A2)","v":"Alston"},{"$f":"IF(ISBLANK('Competition Data'!H2),\"\",'Competition Data'!H2)","v":"ENWL-2"},{"$f":"IF(ISBLANK('Competition Data'!B2),\"\",'Competition Data'!B2)","v":"S25"},{"$f":"IF(ISBLANK('Competition Data'!C2),\"\",'Competition Data'!C2)","v":"Operational Utilisation Variable Availability"},{"$f":"IF(ISBLANK('Competition Data'!G2),\"\",'Competition Data'!G2)","v":97844},{"$f":"IF(ISBLANK('Competition Data'!D2),\"\",'Competition Data'!D2)","v":100},{"$f":"IF(ISBLANK('Competition Data'!E2),\"\",'Competition Data'!E2)","v":1330},{"$f":"IF(ISBLANK('Competition Data'!F2),\"\",'Competition Data'!F2)","v":0.93},{"$f":"CONCATENATE(B2,\" (\",E2,\")\")","v":"Alston (Operational Utilisation Variable Availability)"},{"$f":"IF(ISBLANK('Competition Data'!I2),\"\",'Competition Data'!I2)","v":"N/A"}]
[{"$f":"CONCATENATE(B3,D3,E3)","v":"AlstonW25/26Operational Utilisation Variable Availability"},{"$f":"IF(ISBLANK('Competition Data'!A3),\"\",'Competition Data'!A3)","v":"Alston"},{"$f":"IF(ISBLANK('Competition Data'!H3),\"\",'Competition Data'!H3)","v":"ENWL-2"},{"$f":"IF(ISBLANK('Competition Data'!B3),\"\",'Competition Data'!B3)","v":"W25/26"},{"$f":"IF(ISBLANK('Competition Data'!C3),\"\",'Competition Data'!C3)","v":"Operational Utilisation Variable Availability"},{"$f":"IF(ISBLANK('Competition Data'!G3),\"\",'Competition Data'!G3)","v":104156},{"$f":"IF(ISBLANK('Competition Data'!D3),\"\",'Competition Data'!D3)","v":48},{"$f":"IF(ISBLANK('Competition Data'!E3),\"\",'Competition Data'!E3)","v":688},{"$f":"IF(ISBLANK('Competition Data'!F3),\"\",'Competition Data'!F3)","v":0.99},{"$f":"CONCATENATE(B3,\" (\",E3,\")\")","v":"Alston (Operational Utilisation Variable Availability)"},{"$f":"IF(ISBLANK('Competition Data'!I3),\"\",'Competition Data'!I3)","v":"N/A"}]
["AlstonS26Operational Utilisation Variable Availability",{"$f":"IF(ISBLANK('Competition Data'!A4),\"\",'Competition Data'!A4)","v":"Alston"},{"$f":"IF(ISBLANK('Competition Data'!H4),\"\",'Competition Data'!H4)","v":"ENWL-2"},{"$f":"IF(ISBLANK('Competition Data'!B4),\"\",'Competition Data'!B4)","v":"S26"},{"$f":"IF(ISBLANK('Competition Data'!C4),\"\",'Competition Data'!C4)","v":"Operational Utilisation Variable Availability"},{"$f":"IF(ISBLANK('Competition Data'!G4),\"\",'Competition Data'!G4)","v":98000},{"$f":"IF(ISBLANK('Competition Data'!D4),\"\",'Competition Data'!D4)","v":100},{"$f":"IF(ISBLANK('Competition Data'!E4),\"\",'Competition Data'!E4)","v":1621},{"$f":"IF(ISBLANK('Competition Data'!F4),\"\",'Competition Data'!F4)","v":0.98},"Alston (Operational Utilisation Variable Availability)",{"$f":"IF(ISBLANK('Competition Data'!I4),\"\",'Competition Data'!I4)","v":"N/A"}]
["AlstonW26/27Operational Utilisation Variable Availability",{"$f":"IF(ISBLANK('Competition Data'!A5),\"\",'Competition Data'!A5)","v":"Alston"},{"$f":"IF(ISBLANK('Competition Data'!H5),\"\",'Competition Data'!H5)","v":"ENWL-2"},{"$f":"IF(ISBLANK('Competition Data'!B5),\"\",'Competition Data'!B5)","v":"W26/27"},{"$f":"IF(ISBLANK('Competition Data'!C5),\"\",'Competition Data'!C5)","v":"Operational Utilisation Variable Availability"},{"$f":"IF(ISBLANK('Competition Data'!G5),\"\",'Competition Data'!G5)","v":104000},{"$f":"IF(ISBLANK('Competition Data'!D5),\"\",'Competition Data'!D5)","v":100},{"$f":"IF(ISBLANK('Competition Data'!E5),\"\",'Competition Data'!E5)","v":744},{"$f":"IF(ISBLANK('Competition Data'!F5),\"\",'Competition Data'!F5)","v":1.04},"Alston (Operational Utilisation Variable Availability)",{"$f":"IF(ISBLANK('Competition Data'!I5),\"\",'Competition Data'!I5)","v":"N/A"}]
["AlstonS27Operational Utilisation Variable Availability",{"$f":"IF(ISBLANK('Competition Data'!A6),\"\",'Competition Data'!A6)","v":"Alston"},{"$f":"IF(ISBLANK('Competition Data'!H6),\"\",'Competition Data'!H6)","v":"ENWL-2"},{"$f":"IF(ISBLANK('Competition Data'!B6),\"\",'Competition Data'!B6)","v":"S27"},{"$f":"IF(ISBLANK('Competition Data'!C6),\"\",'Competition Data'!C6)","v":"Operational Utilisation Variable Availability"},{"$f":"IF(ISBLANK('Competition Data'!G6),\"\",'Competition Data'!G6)","v":97649},{"$f":"IF(ISBLANK('Competition Data'!D6),\"\",'Competition Data'!D6)","v":100},{"$f":"IF(ISBLANK('Competition Data'!E6),\"\",'Competition Data'!E6)","v":1670},{"$f":"IF(ISBLANK('Competition Data'!F6),\"\",'Competition Data'!F6)","v":1.02},"Alston (Operational Utilisation Variable Availability)",{"$f":"IF(ISBLANK('Competition Data'!I6),\"\",'Competition Data'!I6)","v":"N/A"}]
["AlstonW27/28Operational Utilisation Variable Availability",{"$f":"IF(ISBLANK('Competition Data'!A7),\"\",'Competition Data'!A7)","v":"Alston"},{"$f":"IF(ISBLANK('Competition Data'!H7),\"\",'Competition Data'!H7)","v":"ENWL-2"},{"$f":"IF(ISBLANK('Competition Data'!B7),\"\",'Competition Data'!B7)","v":"W27/28"},{"$f":"IF(ISBLANK('Competition Data'!C7),\"\",'Competition Data'!C7)","v":"Operational Utilisation Variable Availability"},{"$f":"IF(ISBLANK('Competition Data'!G7),\"\",'Competition Data'!G7)","v":104351},{"$f":"IF(ISBLANK('Competition Data'!D7),\"\",'Competition Data'!D7)","v":100},{"$f":"IF(ISBLANK('Competition Data'!E7),\"\",'Competition Data'!E7)","v":813},{"$f":"IF(ISBLANK('Competition Data'!F7),\"\",'Competition Data'!F7)","v":1.0900000000000001},"Alston (Operational Utilisation Variable Availability)",{"$f":"IF(ISBLANK('Competition Data'!I7),\"\",'Competition Data'!I7)","v":"N/A"}]
["AlstonFY26Operational Utilisation",{"$f":"IF(ISBLANK('Competition Data'!A8),\"\",'Competition Data'!A8)","v":"Alston"},{"$f":"IF(ISBLANK('Competition Data'!H8),\"\",'Competition Data'!H8)","v":"ENWL-3"},{"$f":"IF(ISBLANK('Competition Data'!B8),\"\",'Competition Data'!B8)","v":"FY26"},{"$f":"IF(ISBLANK('Competition Data'!C8),\"\",'Competition Data'!C8)","v":"Operational Utilisation"},{"$f":"IF(ISBLANK('Competition Data'!G8),\"\",'Competition Data'!G8)","v":24310},{"$f":"IF(ISBLANK('Competition Data'!D8),\"\",'Competition Data'!D8)","v":100},{"$f":"IF(ISBLANK('Competition Data'!E8),\"\",'Competition Data'!E8)","v":0},{"$f":"IF(ISBLANK('Competition Data'!F8),\"\",'Competition Data'!F8)","v":1.4},"Alston (Operational Utilisation)",{"$f":"IF(ISBLANK('Competition Data'!I8),\"\",'Competition Data'!I8)","v":173.64285714285714}]
["AlstonFY27Operational Utilisation",{"$f":"IF(ISBLANK('Competition Data'!A9),\"\",'Competition Data'!A9)","v":"Alston"},{"$f":"IF(ISBLANK('Competition Data'!H9),\"\",'Competition Data'!H9)","v":"ENWL-3"},{"$f":"IF(ISBLANK('Competition Data'!B9),\"\",'Competition Data'!B9)","v":"FY27"},{"$f":"IF(ISBLANK('Competition Data'!C9),\"\",'Competition Data'!C9)","v":"Operational Utilisation"},{"$f":"IF(ISBLANK('Competition Data'!G9),\"\",'Competition Data'!G9)","v":24310},{"$f":"IF(ISBLANK('Competition Data'!D9),\"\",'Competition Data'!D9)","v":100},{"$f":"IF(ISBLANK('Competition Data'!E9),\"\",'Competition Data'!E9)","v":0},{"$f":"IF(ISBLANK('Competition Data'!F9),\"\",'Competition Data'!F9)","v":1.4},"Alston (Operational Utilisation)",{"$f":"IF(ISBLANK('Competition Data'!I9),\"\",'Competition Data'!I9)","v":173.64285714285714}]
["AlstonFY28Operational Utilisation",{"$f":"IF(ISBLANK('Competition Data'!A10),\"\",'Competition Data'!A10)","v":"Alston"},{"$f":"IF(ISBLANK('Competition Data'!H10),\"\",'Competition Data'!H10)","v":"ENWL-3"},{"$f":"IF(ISBLANK('Competition Data'!B10),\"\",'Competition Data'!B10)","v":"FY28"},{"$f":"IF(ISBLANK('Competition Data'!C10),\"\",'Competition Data'!C10)","v":"Operational Utilisation"},{"$f":"IF(ISBLANK('Competition Data'!G10),\"\",'Competition Data'!G10)","v":24310},{"$f":"IF(ISBLANK('Competition Data'!D10),\"\",'Competition Data'!D10)","v":100},{"$f":"IF(ISBLANK('Competition Data'!E10),\"\",'Competition Data'!E10)","v":0},{"$f":"IF(ISBLANK('Competition Data'!F10),\"\",'Competition Data'!F10)","v":1.4},"Alston (Operational Utilisation)",{"$f":"IF(ISBLANK('Competition Data'!I10),\"\",'Competition Data'!I10)","v":173.64285714285714}]
{"$rows_left_out":339}
{"sheet":"Lists & wording","index":7,"n_rows":71,"n_cols":18,"rows_kept":71,"cut":false,"hidden":true,"merged":[]}
["Site Names",null,"Service windows",null,"Service Types",null,null,null,null,null,null,null,null,null,null,null,null,{"$f":"IF(A3=\"\",\"\",MAX(A$1:A1)+1)","v":1}]
["Distinct",null,"Distinct",null,"Distinct",null,null,null,null,null,null,null,null,null,null,null,null,{"$f":"IF(A4=\"\",\"\",MAX(A$1:A2)+1)","v":1}]
[{"$f":"IFERROR(INDEX('Competition Data'!$A$2:$A$2996, MATCH(0, INDEX(COUNTIF($A$2:A2, 'Competition Data'!$A$2:$A$2996), 0, 0), 0)), \"\")","v":"Alston"},{"$f":"IF(A3=0,\"\",A3)","v":"Alston"},"W24/25",null,{"$f":"IFERROR(INDEX('Competition Data'!$C$2:$C$2996, MATCH(0, INDEX(COUNTIF($E$2:E2, 'Competition Data'!$C$2:$C$2996), 0, 0), 0)), \"\")","v":"Operational Utilisation Variable Availability"},{"$f":"IF(E3=0,\"\",E3)","v":"Operational Utilisation Variable Availability"},null,null,null,"Message for success","Your tendered price is within the ceiling price. \nNote: This is not a guarantee that your submission will be accepted.",null,null,null,null,null,null,{"$f":"IF(A5=\"\",\"\",MAX(A$1:A3)+1)","v":1}]
[{"$f":"IFERROR(INDEX('Competition Data'!$A$2:$A$2996, MATCH(0, INDEX(COUNTIF($A$2:A3, 'Competition Data'!$A$2:$A$2996), 0, 0), 0)), \"\")","v":"Ambleside, Calgarth, Mintsfeet & Windermere"},{"$f":"IF(A4=0,\"\",A4)","v":"Ambleside, Calgarth, Mintsfeet & Windermere"},"FY25",null,{"$f":"IFERROR(INDEX('Competition Data'!$C$2:$C$2996, MATCH(0, INDEX(COUNTIF($E$2:E3, 'Competition Data'!$C$2:$C$2996), 0, 0), 0)), \"\")","v":"Operational Utilisation"},{"$f":"IF(E4=0,\"\",E4)","v":"Operational Utilisation"},null,null,null,"Message for failure","Your tendered price is not within the ceiling price.\nYou may wish to concider revising your costs in order to improve the likelyhood of being a sucessful participant."]
[{"$f":"IFERROR(INDEX('Competition Data'!$A$2:$A$2996, MATCH(0, INDEX(COUNTIF($A$2:A4, 'Competition Data'!$A$2:$A$2996), 0, 0), 0)), \"\")","v":"Ardwick"},"Ardwick","S25",null,{"$f":"IFERROR(INDEX('Competition Data'!$C$2:$C$2996, MATCH(0, INDEX(COUNTIF($E$2:E4, 'Competition Data'!$C$2:$C$2996), 0, 0), 0)), \"\")","v":"Peak Reduction"},"Peak Reduction"]
[{"$f":"IFERROR(INDEX('Competition Data'!$A$2:$A$2996, MATCH(0, INDEX(COUNTIF($A$2:A5, 'Competition Data'!$A$2:$A$2996), 0, 0), 0)), \"\")","v":"Askerton Castle"},"Askerton Castle","W25/26",null,{"$f":"IFERROR(INDEX('Competition Data'!$C$2:$C$2996, MATCH(0, INDEX(COUNTIF($E$2:E5, 'Competition Data'!$C$2:$C$2996), 0, 0), 0)), \"\")","v":"Scheduled Utilisation"},{"$f":"IF(E6=0,\"\",E6)","v":"Scheduled Utilisation"},null,null,null,"Message for SU, OU, PR product","Ceiling Price is "]
[{"$f":"IFERROR(INDEX('Competition Data'!$A$2:$A$2996, MATCH(0, INDEX(COUNTIF($A$2:A6, 'Competition Data'!$A$2:$A$2996), 0, 0), 0)), \"\")","v":"Bentham"},"Bentham","FY26",null,{"$f":"IFERROR(INDEX('Competition Data'!$C$2:$C$2996, MATCH(0, INDEX(COUNTIF($E$2:E6, 'Competition Data'!$C$2:$C$2996), 0, 0), 0)), \"\")","v":0}]
[{"$f":"IFERROR(INDEX('Competition Data'!$A$2:$A$2996, MATCH(0, INDEX(COUNTIF($A$2:A7, 'Competition Data'!$A$2:$A$2996), 0, 0), 0)), \"\")","v":"Blackpool Airport Enterprise Zone"},"Blackpool Airport Enterprise Zone","S26",null,{"$f":"IFERROR(INDEX('Competition Data'!$C$2:$C$2996, MATCH(0, INDEX(COUNTIF($E$2:E7, 'Competition Data'!$C$2:$C$2996), 0, 0), 0)), \"\")","v":""}]
[{"$f":"IFERROR(INDEX('Competition Data'!$A$2:$A$2996, MATCH(0, INDEX(COUNTIF($A$2:A8, 'Competition Data'!$A$2:$A$2996), 0, 0), 0)), \"\")","v":"Bolton By Bowland"},"Bolton By Bowland","W26/27",null,{"$f":"IFERROR(INDEX('Competition Data'!$C$2:$C$2996, MATCH(0, INDEX(COUNTIF($E$2:E8, 'Competition Data'!$C$2:$C$2996), 0, 0), 0)), \"\")","v":""}]
[{"$f":"IFERROR(INDEX('Competition Data'!$A$2:$A$2996, MATCH(0, INDEX(COUNTIF($A$2:A9, 'Competition Data'!$A$2:$A$2996), 0, 0), 0)), \"\")","v":"Burrow Beck"},"Burrow Beck","FY27",null,{"$f":"IFERROR(INDEX('Competition Data'!$C$2:$C$2996, MATCH(0, INDEX(COUNTIF($E$2:E9, 'Competition Data'!$C$2:$C$2996), 0, 0), 0)), \"\")","v":""}]
{"$rows_left_out":62}
{"sheet":"result period from comp name","index":8,"n_rows":52,"n_cols":28,"rows_kept":52,"cut":false,"hidden":true,"merged":[]}
["Select_name","Result_period",null,null,null,null,null,null,null,null,null,null,null,null,null,null,null,null,null,"Data Validation Formula"]
["= Unique(Competition_name)'","= TOROW'",null,null,null,null,null,null,null,null,null,null,null,null,null,null,null,null,null,"Yealand",{"$f":"_xlfn.ANCHORARRAY( _xlfn.XLOOKUP(T2, select_name_for_result_period, result_period_from_select_name))","v":"W25/26"},"S26","W26/27","S27","W27/28","FY26","FY27","FY28"]
[{"$f":" _xlfn.UNIQUE(Competition_Name)","v":"Alston"},{"$f":" _xlfn.TOROW(_xlfn.UNIQUE(_xlfn._xlws.FILTER(Period, Competition_Name=A3, \"Empty List\")))","v":"S25"},"W25/26","S26","W26/27","S27","W27/28","FY26","FY27","FY28",null,null,null,null,null,null,null,null,null,"https://www.youtube.com/watch?v=U3WnM2JCrVc"]
["Ambleside, Calgarth, Mintsfeet & Windermere",{"$f":" _xlfn.TOROW(_xlfn.UNIQUE(_xlfn._xlws.FILTER(Period, Competition_Name=A4, \"Empty List\")))","v":"W26/27"},"W27/28"]
["Ardwick",{"$f":" _xlfn.TOROW(_xlfn.UNIQUE(_xlfn._xlws.FILTER(Period, Competition_Name=A5, \"Empty List\")))","v":"W25/26"},"W26/27","W27/28"]
["Askerton Castle",{"$f":" _xlfn.TOROW(_xlfn.UNIQUE(_xlfn._xlws.FILTER(Period, Competition_Name=A6, \"Empty List\")))","v":"FY26"},"FY27","FY28"]
["Bentham",{"$f":" _xlfn.TOROW(_xlfn.UNIQUE(_xlfn._xlws.FILTER(Period, Competition_Name=A7, \"Empty List\")))","v":"FY26"},"FY27","FY28"]
["Blackpool Airport Enterprise Zone",{"$f":" _xlfn.TOROW(_xlfn.UNIQUE(_xlfn._xlws.FILTER(Period, Competition_Name=A8, \"Empty List\")))","v":"S25"},"W25/26","S26","W26/27","S27","W27/28"]
["Bolton By Bowland",{"$f":" _xlfn.TOROW(_xlfn.UNIQUE(_xlfn._xlws.FILTER(Period, Competition_Name=A9, \"Empty List\")))","v":"FY26"},"FY27","FY28"]
["Burrow Beck",{"$f":" _xlfn.TOROW(_xlfn.UNIQUE(_xlfn._xlws.FILTER(Period, Competition_Name=A10, \"Empty List\")))","v":"S25"},"W25/26","S26","W26/27","S27","W27/28"]
{"$rows_left_out":43}
{"sheet":"result type from comp name","index":9,"n_rows":47,"n_cols":21,"rows_kept":47,"cut":false,"hidden":true,"merged":[]}
["Select_name","Result_period",null,null,null,null,null,null,null,null,null,null,null,null,null,null,null,null,null,"Data Validation Formula"]
["= Unique(competition_type)'","= TOROW'",null,null,null,null,null,null,null,null,null,null,null,null,null,null,null,null,null,"moss lane",{"$f":"_xlfn.ANCHORARRAY( _xlfn.XLOOKUP(T4, select_name_for_result_type, result_type_from_select_name))","v":{"$error":"#REF!"}}]
[{"$f":" _xlfn.UNIQUE(Competition_Name)","v":"Alston"},{"$f":" _xlfn.TOROW(_xlfn.UNIQUE(_xlfn._xlws.FILTER(Competition_type, Competition_Name=A3, \"Empty List\")))","v":"Operational Utilisation Variable Availability"},"Operational Utilisation","Peak Reduction"]
["Ambleside, Calgarth, Mintsfeet & Windermere",{"$f":" _xlfn.TOROW(_xlfn.UNIQUE(_xlfn._xlws.FILTER(Competition_type, Competition_Name=A4, \"Empty List\")))","v":"Operational Utilisation Variable Availability"},"Peak Reduction"]
["Ardwick",{"$f":" _xlfn.TOROW(_xlfn.UNIQUE(_xlfn._xlws.FILTER(Competition_type, Competition_Name=A5, \"Empty List\")))","v":"Operational Utilisation Variable Availability"},"Operational Utilisation","Peak Reduction"]
["Askerton Castle",{"$f":" _xlfn.TOROW(_xlfn.UNIQUE(_xlfn._xlws.FILTER(Competition_type, Competition_Name=A6, \"Empty List\")))","v":"Operational Utilisation"}]
["Bentham",{"$f":" _xlfn.TOROW(_xlfn.UNIQUE(_xlfn._xlws.FILTER(Competition_type, Competition_Name=A7, \"Empty List\")))","v":"Operational Utilisation"}]
["Blackpool Airport Enterprise Zone",{"$f":" _xlfn.TOROW(_xlfn.UNIQUE(_xlfn._xlws.FILTER(Competition_type, Competition_Name=A8, \"Empty List\")))","v":"Peak Reduction"},"Scheduled Utilisation"]
["Bolton By Bowland",{"$f":" _xlfn.TOROW(_xlfn.UNIQUE(_xlfn._xlws.FILTER(Competition_type, Competition_Name=A9, \"Empty List\")))","v":"Operational Utilisation"}]
["Burrow Beck",{"$f":" _xlfn.TOROW(_xlfn.UNIQUE(_xlfn._xlws.FILTER(Competition_type, Competition_Name=A10, \"Empty List\")))","v":"Operational Utilisation Variable Availability"},"Operational Utilisation","Peak Reduction"]
{"$rows_left_out":37}