{"text_format":"1","workbook":"xlsx","n_sheets":17,"sheets":["data","For approval only","Input","Splitting feeder calculation","Unused ASC Allowance","R Form","Before Drwg","After Drwg","Study request guidance notes","G&P application","Cable ratings","ASL calculation","Splitting feeder calculatio (3)","Splitting feeder calculatio (2)","CAF calculator","CAF calculator instructions","Sheet1"],"not_rendered":{"charts":0,"images":14,"macros":1,"external_links":0,"defined_names":15,"comments":2,"pivot_tables":0},"unopened":[],"bounds":{"document_bytes":16777216,"sheet_cells":100000,"rows_first":2000,"rows_last":500,"rows_between":2000,"halvings":0,"cell_chars":16384,"cell_head_chars":4096},"cells_cut":0,"cells_raw":0,"read":"whole","date_system":"1900"}

{"sheet":"data","index":0,"n_rows":377,"n_cols":20,"rows_kept":377,"cut":false,"hidden":true,"merged":[]}
["Primary s/s","£ per kVA","G&P STUDY REQUIRED","Hv diagram area","VOLTAGE",null,"11kV",11000,null,"Size","Continuous","Cyclic","Distribution",null,"Planner","Tel (Internal)","Fax","Area"]
["ALBION ST",0,null,"BLACKBURN","6.6kV",null,"6.6kV",6600,null,"95 XXX",245,277,277,null,"Alan Bradley",81868,81732,"Planning Preston"]
["ALDERLEY",0,null,"PEAK SOUTH","11kV",null,null,null,null,"95 PICAS",185,210,245,null,"Alan Kemp",81834,81841,"Statutory Preston"]
["ALSTON",0,null,"PENRITH","11kV",null,null,null,null,"95 Cu PILC",245,275,330,null,"Alek Hyzniak",22961,22314,"Manchester",null,"OK WITH DIVERSITY"]
["AMBLESIDE",0,null,"KENDAL","11kV",null,null,null,null,"95 Al PILC",190,215,260,null,"Allen Rawcliffe",81468,81503,"Statutory Preston",null,"ALTERNTIVE AVAILABLE"]
["ANCOATS NORTH",0,null,"MANCHESTER NORTH","6.6kV",null,null,null,null,"300 XXX",461,521,521,null,"Andrew Twyford","01524 701423",null,"Planning Kendal",null,"NOT DUE TO NEW LOAD"]
["ANNIE PIT",0,null,"WORKINGTON","11kV",null,null,null,null,"300 PICAS",355,400,490,null,"Andy Lees",22930,22314,"Manchester",null,"RESTORE SUPPLIES BY SPLITTING"]
["ANSDELL",0,null,"BLACKPOOL","6.6kV",null,null,null,null,"300 Cu PILC",460,520,665,null,"Anne Thomson",22139,22314,"Manchester",null,"FEEDER SPLIT TO RESTORE SUPPLIES"]
["ARDWICK",224.7,"LV charges are £153.31. All charges apply until 29/6/2014. Proj ref d.80010717.799","MANCHESTER SOUTH","6.6kV",null,null,null,null,"300 Al PILC",365,410,525,null,"Bill Halliwell",81610,81503,"Statutory Preston",null,"SEE BELOW FOR REDUCED SECTION"]
["ARNSIDE",0,null,"LANCASTER","11kV",null,null,null,null,"240 Cu PILC",410,460,460,null,"Bryan Jenkinson",86128,86009,"Planning Kendal",null,"TO CHECK REDUCED SECTION IN FEEDER"]
{"$rows_left_out":368}
{"sheet":"For approval only","index":1,"n_rows":26,"n_cols":2,"rows_kept":26,"cut":false,"hidden":true,"merged":[[10,0,11,5]]}
["NC"]
[{"$f":"Input!L9","v":0},"kVA"]
[]
["R11/11/11"]
[]
[{"$f":"Input!L4","v":0}]
[{"$f":"Input!G1","v":""}]
[{"$f":"Input!E6","v":0}]
[{"$f":"'R Form'!E55","v":{"$error":"#N/A"}}]
[{"$f":"Input!E3","v":0}]
{"$rows_left_out":17}
{"sheet":"Input","index":2,"n_rows":94,"n_cols":54,"rows_kept":94,"cut":false,"hidden":false,"merged":[[67,10,67,13],[63,3,63,6],[62,10,62,13],[63,10,63,13],[69,10,69,13],[90,3,90,6],[90,10,90,13],[83,10,83,13],[67,3,67,6],[74,3,74,6],[71,5,72,6],[87,5,88,6],[87,12,88,13],[80,12,81,13],[83,3,83,6],[79,3,79,6],[79,10,79,13],[85,3,85,6],[86,3,86,6],[86,10,86,13],[80,5,81,6],[55,3,55,6],[56,3,56,6],[62,3,62,6],[71,12,72,13],[78,3,78,6],[69,3,69,6],[70,3,70,6],[70,10,70,13],[64,12,65,13],[60,10,60,13],[64,5,65,6],[60,3,60,6],[57,5,58,6],[78,10,78,13],[57,12,58,13],[74,10,74,13],[3,11,3,12],[2,4,3,8],[22,1,22,4],[23,1,23,4],[2,11,2,12],[20,1,20,4],[21,1,21,4],[8,8,9,10],[7,4,7,5],[11,4,12,5],[11,1,12,3],[18,1,18,4],[8,4,8,5],[9,4,9,5],[8,6,8,7],[9,6,9,7],[53,3,53,6],[46,3,46,6],[43,5,44,6],[50,5,51,6],[13,4,13,5],[41,3,41,6],[30,1,30,4],[24,1,24,4],[25,1,25,4],[28,1,28,4],[27,1,27,4],[85,10,85,13],[5,4,5,5],[50,12,51,13],[43,12,44,13],[26,1,26,4],[49,3,49,6],[19,1,19,4],[17,1,17,4],[48,3,48,6],[29,1,29,4],[42,10,42,13],[41,10,41,13],[42,3,42,6],[31,1,31,4],[38,1,38,4],[37,1,37,7],[48,10,48,13],[49,10,49,13],[55,10,55,13],[56,10,56,13],[46,10,46,13],[53,10,53,13]]}
[null,"LOADCHECK - R form calculation sheet -",null,null,null,null,{"$f":"IF('R Form'!O15=\"\",\"\",'R Form'!O15)","v":""},null,null,null,null,null,{"$f":"'R Form'!E66","v":"Version3 (11/02/2014)"},null,null,null,null,null,null,null,null,null,null,null,null,null,null,null,null,null,null,null,null,null,null,null,null,null,null,null,null,null,null,null,null,null,null,null,null,null,null,null,"Please Select From List...","Please Select From List..."]
[null,null,null,null,null,null,null,null,null,null,null,null,null,null,null,null,null,null,null,null,true,"SOEDC RELATED",null,{"$f":"VLOOKUP(T11,U2:V3,2,0)","v":0},null,null,null,null,null,null,null,null,null,null,null,null,null,null,null,null,null,null,null,null,null,null,null,null,null,null,null,null,"Proposed","Automation"]
[null,null,null,"Scheme Name and address:",null,null,null,null,null,null,"Date:",null,null,null,null,null,null,null,null,null,false,null,null,null,null,null,null,null,null,null,null,null,null,null,null,null,null,null,null,null,null,null,null,null,null,null,null,null,null,null,null,null,"Committed","Diversion"]
[null,null,null,null,null,null,null,null,null,null,"Scheme number:",null,null,null,null,null,null,null,null,null,null,null,null,null,null,null,null,null,null,null,null,null,null,null,null,null,null,null,null,null,null,null,null,null,null,null,null,null,null,null,null,null,"Cancelled","Sw Gr Change"]
[null,null,null,null,null,null,null,null,null,null,null,{"$f":"IF((L6-L8)>999,\"G&P STUDY REQUIRED\",\"\")","v":""},null,null,null,null,null,null,null,null,null,null,null,null,null,null,null,null,null,null,null,null,null,null,null,null,null,null,null,null,null,null,null,null,null,null,null,null,null,null,null,null,"Completed","ESQCR"]
[null,null,null,"Planner:",null,null,"Tel:",{"$f":"VLOOKUP(E6,data!O2:R83,2,0)","v":{"$error":"#N/A"}},null,null,"Proposed MIC:",null,null,"Proposed MEC:",null,"kVA",null,null,null,null,null,null,null,null,null,null,null,null,null,null,null,null,null,null,null,null,null,null,null,null,null,null,null,null,null,null,null,null,null,null,null,null,null,"Generation"]
[null,null,null,null,null,null,"Fax:",{"$f":"VLOOKUP(E6,data!O2:R83,3,0)","v":{"$error":"#N/A"}},null,null,"Existing MIC:",null,null,"Existing MEC:",null,"kVA",null,null,null,null,null,null,null,null,null,null,null,null,null,null,null,null,null,null,null,null,null,null,null,null,null,null,null,null,null,null,null,null,null,null,null,null,null,"Reinforcement"]
[null,null,null,"Voltage:",null,null,null,null,null,null,"Existing demand of customer:",null,"kVA",null,null,null,null,null,null,null,null,null,null,null,null,null,null,null,null,null,null,null,null,null,null,null,null,null,null,null,null,null,null,null,null,null,null,null,null,null,null,null,null,"C2C"]
[null,null,null,"Status:",null,null,{"$f":"IF(E9=\"Please Select From List...\",\"REQUIRED FIELD\",\"\")","v":""},null,"Additional load on network:",null,null,{"$f":"L6-L8","v":0},"kVA",null,null,null,null,null,null,null,{"$f":"VLOOKUP(E8,data!G1:H2,2,0)","v":{"$error":"#N/A"}},{"$f":"IF(U9=6600,6.6,11)","v":{"$error":"#N/A"}},null,null,null,null,null,null,null,null,null,null,null,null,null,null,null,null,null,null,null,null,null,null,null,null,null,null,null,null,null,null,null,"NOP move"]
[null,null,null,"Type:",null,null,{"$f":"IF(E10=\"Please Select From List...\",\"REQUIRED FIELD\",\"\")","v":""},null,null,null,null,{"$f":"IF(L6=\"\",\"\",SUM((L6-L8)*1000)/(U9*SQRT(3)))","v":""},"Amps",null,null,null,null,null,null,null,null,null,null,null,null,null,null,null,null,null,null,null,null,null,null,null,null,null,null,null,null,null,null,null,null,null,null,null,null,null,null,null,null,"Asset Removal"]
{"$rows_left_out":85}
{"sheet":"Splitting feeder calculation","index":3,"n_rows":32,"n_cols":16,"rows_kept":32,"cut":false,"hidden":true,"merged":[[2,2,2,3],[2,5,2,6],[0,1,0,6]]}
["Feeder Name:",null,null,null,null,null,null,null,null,null,null,null,null,{"$f":"Input!U9","v":{"$error":"#N/A"}}]
[null,null,null,null,null,null,null,null,null,null,null,null,null,"Diversity"]
["Substation name","Substation number","MD of Tx",null,null,"Diversified load (Amps)",null,null,null,null,null,null,null,{"$f":"C28/C27","v":{"$error":"#N/A"}}]
["Duddon Road",616064,500,"kVA",{"$f":"SUM(C4*1000)/($N$1*SQRT(3))","v":{"$error":"#N/A"}},{"$f":"SUM((C4*1000)/($N$1*SQRT(3)))*$C$30","v":{"$error":"#N/A"}},null,null,null,null,null,null,null,false,{"$f":"IF(N4=TRUE,F4,0)","v":0},{"$f":"IF(N4=FALSE,F4,0)","v":{"$error":"#N/A"}}]
["St Georges Square",618006,400,"kVA",{"$f":"SUM(C5*1000)/($N$1*SQRT(3))","v":{"$error":"#N/A"}},{"$error":"#N/A"},null,null,null,null,null,null,null,false,{"$f":"IF(N5=TRUE,F5,0)","v":0},{"$f":"IF(N5=FALSE,F5,0)","v":{"$error":"#N/A"}}]
["Haverigg Windfarm 'D'",619460,40,"kVA",{"$f":"SUM(C6*1000)/($N$1*SQRT(3))","v":{"$error":"#N/A"}},{"$error":"#N/A"},null,null,null,null,null,null,null,false,0,{"$error":"#N/A"}]
["Back Duke St.",616006,360,"kVA",{"$error":"#N/A"},{"$error":"#N/A"},null,null,null,null,null,null,null,false,0,{"$error":"#N/A"}]
["Kings Quarry",616009,415,"kVA",{"$error":"#N/A"},{"$error":"#N/A"},null,null,null,null,null,null,null,false,0,{"$error":"#N/A"}]
["Lowther Rd",616007,325,"kVA",{"$error":"#N/A"},{"$error":"#N/A"},null,null,null,null,null,null,null,false,0,{"$error":"#N/A"}]
["Moor End",610087,15,"kVA",{"$error":"#N/A"},{"$error":"#N/A"},null,null,null,null,null,null,null,false,0,{"$error":"#N/A"}]
{"$rows_left_out":23}
{"sheet":"Unused ASC Allowance","index":4,"n_rows":155,"n_cols":10,"rows_kept":155,"cut":false,"hidden":false,"merged":[[154,0,154,5],[47,0,47,7],[124,0,124,7],[132,0,132,5],[135,0,135,7],[143,0,143,5],[146,0,146,7],[102,0,102,7],[110,0,110,5],[113,0,113,7],[58,0,58,7],[66,0,66,5],[69,0,69,7],[77,0,77,5],[121,0,121,5],[80,0,80,7],[88,0,88,5],[91,0,91,7],[99,0,99,5],[11,0,11,5],[11,18,11,23],[55,0,55,5],[36,0,36,7],[44,0,44,5],[3,0,3,7],[14,0,14,7],[22,0,22,5],[25,0,25,7],[33,0,33,5]]}
["Unused ASC (existing and future customers)"]
[]
[]
[{"$f":"Input!B19","v":0}]
["Customer","MPAN","ASC","MD","Unused","Factor","Results"]
[null,null,null,null,{"$f":"IF(C6=\"\",\"\",SUM(C6-D6))","v":""},0,{"$f":"IF(F6=0,\"\",SUM(F6*E6))","v":""},null,null,{"$f":"Input!U9","v":{"$error":"#N/A"}}]
[null,null,null,null,"",0,"",null,null,{"$f":"SUM(G6:G11)","v":0}]
[null,null,null,null,"",0,""]
[null,null,null,null,"",0,""]
[null,null,null,null,"",0,""]
{"$rows_left_out":146}
{"sheet":"R Form","index":5,"n_rows":67,"n_cols":28,"rows_kept":67,"cut":false,"hidden":false,"merged":[[7,4,7,10],[7,14,7,20],[7,1,7,3],[7,11,7,13],[65,8,65,10],[65,18,65,20],[64,14,64,17],[65,14,65,17],[64,1,64,3],[65,1,65,3],[64,4,64,7],[65,4,65,7],[64,11,64,13],[65,11,65,13],[64,8,64,10],[64,18,64,20],[14,1,15,7],[11,9,11,10],[11,5,11,6],[14,14,15,20],[11,1,11,4],[12,1,13,6],[11,7,11,8],[9,11,10,15],[8,5,8,10],[9,5,9,10],[10,5,10,8],[10,9,10,10],[5,18,6,19],[5,11,6,17],[6,4,6,5],[6,8,6,10],[3,4,5,10],[16,11,16,20],[50,14,51,15],[52,14,53,15],[48,1,49,3],[48,4,49,10],[50,1,51,3],[50,4,51,10],[52,1,53,3],[52,4,53,10],[44,1,45,12],[46,3,47,15],[16,1,16,10],[56,1,57,3],[56,4,57,10],[62,1,62,20],[50,16,51,20],[52,16,53,20],[54,11,59,13],[54,14,55,15],[54,16,55,20],[56,14,57,15],[56,16,57,20],[58,14,59,15],[58,16,59,20],[58,1,59,3],[58,4,59,10],[54,1,55,3],[54,4,55,10],[1,1,1,13],[66,3,66,18],[3,1,4,3],[42,1,43,20],[9,16,10,20],[11,14,11,20],[17,1,41,10],[17,11,41,20],[5,20,6,20],[46,16,47,20],[2,1,2,10],[48,16,49,20],[60,1,61,6],[60,8,61,20],[48,11,53,13],[48,14,49,15]]}
[null,"REQUEST FOR ALTERATION TO HV SYSTEM 'R' FORM"]
[null,"Approval of this form must not be taken as an endorsement of the Health & Safety, technical or economic merits of the proposed alteration (see EDP 282, 4.1)."]
[]
[null,{"$f":"Input!D3","v":"Scheme Name and address:"},null,null,{"$f":"Input!E3","v":0},null,null,null,null,null,null,null,null,"Existing MIC:",{"$f":"Input!L7","v":0},"kVA",null,null,"Proposed MIC:",{"$f":"Input!L6","v":0},"kVA"]
[null,null,null,null,null,null,null,null,null,null,null,null,null,"Existing MEC:",{"$f":"Input!O7","v":0},"kVA",null,null,"Proposed MEC:",{"$f":"Input!O6","v":0},"kVA"]
[null,null,null,null,null,null,null,null,null,null,null,"Estimated increase in demand on the                        network to be seen above the existing levels:",null,null,null,null,null,null,{"$f":"Input!L9","v":0},null,"kVA"]
[null,null,null,"Post code:",null,null,null,"Project No.",{"$f":"Input!L4","v":0}]
[null,"Status:",null,null,{"$f":"Input!E9","v":0},null,null,null,null,null,null,"Type:",null,null,{"$f":"Input!E10","v":0}]
[null,null,null,null,"Primary Substation:",{"$f":"Input!E12","v":0},null,null,null,null,null,"Approval use only"]
[null,null,null,null,"Primary feeder name:",{"$f":"Z10","v":{"$error":"#N/A"}},null,null,null,null,null,"RELEASED:",null,null,null,null,null,null,null,null,null,null,null,null,"YES",{"$f":"VLOOKUP(Y10,AA10:AB22,2,0)","v":{"$error":"#N/A"}},{"$f":"Input!J19","v":0},{"$f":"Input!B19","v":0}]
{"$rows_left_out":58}
{"sheet":"Before Drwg","index":6,"n_rows":22,"n_cols":28,"rows_kept":22,"cut":false,"hidden":false,"merged":[]}
[]
[]
[]
[]
[]
[]
[]
[]
[]
[null,null,null,null,null,null,null,null,null,null,null,null,null,null,null,null,null,null,null,null,null,null,null,null,"YES",{"$f":"VLOOKUP(Y10,AA10:AB22,2,0)","v":{"$error":"#N/A"}},{"$f":"Input!J19","v":0},{"$f":"Input!B19","v":0}]
{"$rows_left_out":13}
{"sheet":"After Drwg","index":7,"n_rows":22,"n_cols":28,"rows_kept":22,"cut":false,"hidden":false,"merged":[]}
[]
[]
[]
[]
[]
[]
[]
[]
[]
[null,null,null,null,null,null,null,null,null,null,null,null,null,null,null,null,null,null,null,null,null,null,null,null,"YES",{"$f":"VLOOKUP(Y10,AA10:AB22,2,0)","v":{"$error":"#N/A"}},{"$f":"Input!J19","v":0},{"$f":"Input!B19","v":0}]
{"$rows_left_out":13}
{"sheet":"Study request guidance notes","index":8,"n_rows":0,"n_cols":0,"rows_kept":0,"cut":false,"hidden":true,"merged":[]}

{"sheet":"G&P application","index":9,"n_rows":52,"n_cols":11,"rows_kept":52,"cut":false,"hidden":true,"merged":[[43,4,43,5],[1,1,2,3],[11,3,11,5],[13,3,13,4],[21,3,21,5],[25,2,25,3],[25,4,25,5],[30,1,40,5],[43,1,43,3]]}
[null,null,null,null,null,null,null,null,null,null,"Regulatory Classification:"]
[null,null,null,null,null,null,null,null,null,null,"Customer funded feasibility study"]
[null,null,null,null,null,null,null,null,null,null,"Budget Quote<1MVA (10 Working Days)"]
[null,null,null,null,null,null,null,null,null,null,"Budget Quote>1MVA (20 Working Days)"]
[null,"REQUEST FOR G&P WORK",null,null,null,null,null,null,null,null,"Statutory Provision of HV Demand Quote (35 Working Days)"]
[null,null,null,null,null,null,null,null,null,null,"Statutory Provision of HV Generation Quote (65 Working Days)"]
[null,null,null,null,null,null,null,null,null,null,"Statutory Provision of EHV Demand/Generation Quote (65 Working Days)"]
[null,"Requested by: ",null,{"$f":"Input!E6","v":0},"Date:",{"$f":"IF(Input!L3=\"\",\"\",Input!L3)","v":""},null,null,null,null,"Competitive Provision of HV Demand Quote (20 Working Days)"]
[null,null,null,null,null,null,null,null,null,null,"Competitive Provision of HV Generation Quote (50 Working Days)"]
[null,"Contact Phone Number:",null,{"$f":"Input!H6","v":{"$error":"#N/A"}},"Request Type:",null,null,null,null,null,"Competitive Provision of EHV (33kV) Demand Quote (50 Working Days)"]
{"$rows_left_out":43}
{"sheet":"Cable ratings","index":10,"n_rows":57,"n_cols":6,"rows_kept":57,"cut":false,"hidden":true,"merged":[]}
[null,"RATINGS USED"]
[]
[null,"BELOW ARE THE RATINGS USED FOR THE CALCULATIONS UNDERTAKEN BY 'LOADCHECK' . "]
[null,"Subject to the parameters used being applicable (see below), this table may be used as a crib-sheet for general use."]
[]
[]
[null,"(The information in this table has been taken from the 'Summary of Cable Ratings' on Page 37 "]
[null,"of CP203 ISSUE 4 (12/01/09). Please refer to CP203 for the parameters used)."]
[]
[null,"Size","Continuous","Cyclic","Distribution","Comment"]
{"$rows_left_out":48}
{"sheet":"ASL calculation","index":11,"n_rows":59,"n_cols":10,"rows_kept":59,"cut":false,"hidden":true,"merged":[]}
[null,null,"Calculation of Ratings of Auto Sectionalising Links"]
[]
["Job Ref:",{"$f":"Input!L4","v":0}," "]
[]
[]
[]
[null,null,"EXISTING",null,null,null,null,"PROPOSED"]
[null,{"$f":"Input!V9","v":{"$error":"#N/A"}},"kV select O/H line Voltage ",null,null,null,{"$f":"B8","v":{"$error":"#N/A"}},"kV select O/H line Voltage "]
[]
[null,"T/F  kVA Nameplate rating *",null,null,null,null,"T/F  kVA Nameplate rating"]
{"$rows_left_out":50}
{"sheet":"Splitting feeder calculatio (3)","index":12,"n_rows":32,"n_cols":16,"rows_kept":32,"cut":false,"hidden":true,"merged":[[2,2,2,3],[2,5,2,6],[0,1,0,6]]}
["Feeder Name:","Askam - Duddon Road",null,null,null,null,null,null,null,null,null,null,null,{"$f":"Input!U9","v":{"$error":"#N/A"}}]
[null,null,null,null,null,null,null,null,null,null,null,null,null,"Diversity"]
["Substation name","Substation number","MD of Tx",null,null,"Diversified load (Amps)",null,null,null,null,null,null,null,{"$f":"C28/C27","v":{"$error":"#N/A"}}]
["Duddon Road",616064,500,"kVA",{"$f":"SUM(C4*1000)/($N$1*SQRT(3))","v":{"$error":"#N/A"}},{"$f":"SUM((C4*1000)/($N$1*SQRT(3)))*$C$30","v":{"$error":"#N/A"}},null,null,null,null,null,null,null,false,{"$f":"IF(N4=TRUE,F4,0)","v":0},{"$f":"IF(N4=FALSE,F4,0)","v":{"$error":"#N/A"}}]
["St Georges Square",618006,400,"kVA",{"$error":"#N/A"},{"$error":"#N/A"},null,null,null,null,null,null,null,false,0,{"$error":"#N/A"}]
["Haverigg Windfarm 'D'",619460,40,"kVA",{"$error":"#N/A"},{"$error":"#N/A"},null,null,null,null,null,null,null,false,0,{"$error":"#N/A"}]
["Back Duke St.",616006,360,"kVA",{"$error":"#N/A"},{"$error":"#N/A"},null,null,null,null,null,null,null,false,0,{"$error":"#N/A"}]
["Kings Quarry",616009,415,"kVA",{"$error":"#N/A"},{"$error":"#N/A"},null,null,null,null,null,null,null,false,0,{"$error":"#N/A"}]
["Lowther Rd",616007,325,"kVA",{"$error":"#N/A"},{"$error":"#N/A"},null,null,null,null,null,null,null,false,0,{"$error":"#N/A"}]
["Moor End",610087,15,"kVA",{"$error":"#N/A"},{"$error":"#N/A"},null,null,null,null,null,null,null,false,0,{"$error":"#N/A"}]
{"$rows_left_out":23}
{"sheet":"Splitting feeder calculatio (2)","index":13,"n_rows":32,"n_cols":16,"rows_kept":32,"cut":false,"hidden":true,"merged":[[2,2,2,3],[2,5,2,6],[0,1,0,6]]}
["Feeder Name:","Askam - Duddon Road",null,null,null,null,null,null,null,null,null,null,null,{"$f":"Input!U9","v":{"$error":"#N/A"}}]
[null,null,null,null,null,null,null,null,null,null,null,null,null,"Diversity"]
["Substation name","Substation number","MD of Tx",null,null,"Diversified load (Amps)",null,null,null,null,null,null,null,{"$f":"C28/C27","v":{"$error":"#N/A"}}]
["Duddon Road",616064,500,"kVA",{"$f":"SUM(C4*1000)/($N$1*SQRT(3))","v":{"$error":"#N/A"}},{"$f":"SUM((C4*1000)/($N$1*SQRT(3)))*$C$30","v":{"$error":"#N/A"}},null,null,null,null,null,null,null,false,{"$f":"IF(N4=TRUE,F4,0)","v":0},{"$f":"IF(N4=FALSE,F4,0)","v":{"$error":"#N/A"}}]
["St Georges Square",618006,400,"kVA",{"$error":"#N/A"},{"$error":"#N/A"},null,null,null,null,null,null,null,false,0,{"$error":"#N/A"}]
["Haverigg Windfarm 'D'",619460,40,"kVA",{"$error":"#N/A"},{"$error":"#N/A"},null,null,null,null,null,null,null,false,0,{"$error":"#N/A"}]
["Back Duke St.",616006,360,"kVA",{"$error":"#N/A"},{"$error":"#N/A"},null,null,null,null,null,null,null,false,0,{"$error":"#N/A"}]
["Kings Quarry",616009,415,"kVA",{"$error":"#N/A"},{"$error":"#N/A"},null,null,null,null,null,null,null,false,0,{"$error":"#N/A"}]
["Lowther Rd",616007,325,"kVA",{"$error":"#N/A"},{"$error":"#N/A"},null,null,null,null,null,null,null,false,0,{"$error":"#N/A"}]
["Moor End",610087,15,"kVA",{"$error":"#N/A"},{"$error":"#N/A"},null,null,null,null,null,null,null,false,0,{"$error":"#N/A"}]
{"$rows_left_out":23}
{"sheet":"CAF calculator","index":14,"n_rows":55,"n_cols":8,"rows_kept":55,"cut":false,"hidden":true,"merged":[[0,4,1,6]]}
[null,{"$f":"IF(Input!L4=\"\",\"\",Input!L4)","v":""},"Apportionment for: ",null,{"$f":"IF(Input!E3=\"\",\"\",Input!E3)","v":""},null,null,{"$f":"IF(Input!L3=\"\",\"\",Input!L3)","v":""}]
[]
[null,null,"100% to ","VARIABLE","CAF","GROUPS","100% TO"]
[null,"Line No:","CUST","A: T/F","B: HV","C: LV","ENW"]
[null,1]
[null,2]
[null,3]
[null,4]
[null,5]
[null,6]
{"$rows_left_out":46}
{"sheet":"CAF calculator instructions","index":15,"n_rows":55,"n_cols":8,"rows_kept":55,"cut":false,"hidden":true,"merged":[]}
[null,"Y******","Apportionment for: ",null,null,null,null,{"$f":"TODAY()","v":"2015-09-22"}]
[]
[null,null,"100% to ","VARIABLE","CAF","GROUPS","100% TO"]
[null,"Line No:","CUST","A: T/F","B: HV","C: LV","ENW"]
[null,1]
[null,2]
[null,3]
[null,4]
[null,5]
[null,6]
{"$rows_left_out":46}
{"sheet":"Sheet1","index":16,"n_rows":0,"n_cols":0,"rows_kept":0,"cut":false,"hidden":false,"merged":[]}